Undecanoic acid, methyl ester

Kovats' RI, polar column, isothermal

Data compiled by: NIST Mass Spectrometry Data Center, William E. Wallace, director

Column type CapillaryCapillaryCapillaryCapillaryCapillary
Active phase CP-WaxDB-WaxCarbowax 20MCarbowax 20MCarbowax 20M
Column length (m) 25.25.22.25.25.
Carrier gas   N2N2N2
Substrate
Column diameter (mm) 0.250.250.30.250.25
Phase thickness (μm) 0.220.22
Temperature (C) 240.240.140.110.110.
I 1699.1732.1672.1696.61704.6
ReferenceHanai and Hong, 1989Hanai and Hong, 1989Haken and Korhonen, 1984Krupcik, Matisova, et al., 1982Krupcik, Matisova, et al., 1982
Comment MSDC-RI MSDC-RI MSDC-RI MSDC-RI MSDC-RI
Column type CapillaryCapillaryCapillaryCapillaryCapillary
Active phase Carbowax 20MCarbowax 20MCarbowax 20MCarbowax 20MCarbowax 20M
Column length (m) 25.25.25.25.25.
Carrier gas N2N2N2N2N2
Substrate
Column diameter (mm) 0.250.250.250.250.25
Phase thickness (μm)
Temperature (C) 110.110.90.90.90.
I 1705.71728.71686.71701.81706.6
ReferenceKrupcik, Matisova, et al., 1982Krupcik, Matisova, et al., 1982Krupcik, Matisova, et al., 1982Krupcik, Matisova, et al., 1982Krupcik, Matisova, et al., 1982
Comment MSDC-RI MSDC-RI MSDC-RI MSDC-RI MSDC-RI
Column type CapillaryCapillaryPacked
Active phase Carbowax 20MCarbowax 20MPolyethylene Glycol
Column length (m) 25. 2.
Carrier gas N2N2He
Substrate   Celite 545 (0.20-0.50 mm)
Column diameter (mm) 0.25
Phase thickness (μm)
Temperature (C) 90.120.170.
I 1711.61710.1732.
ReferenceKrupcik, Matisova, et al., 1982Moore and Brown, 1976Shashkova, Znamenskaia, et al., 1969
Comment MSDC-RI MSDC-RI MSDC-RI

Kovats' RI, non-polar column, temperature ramp

Data compiled by: NIST Mass Spectrometry Data Center, William E. Wallace, director

Column type CapillaryCapillary
Active phase OV-101OV-101
Column length (m) 50.50.
Carrier gas
Substrate
Column diameter (mm) 0.230.23
Phase thickness (μm)
Tstart (C) 80.80.
Tend (C) 200.200.
Heat rate (K/min) 2.2.
Initial hold (min)
Final hold (min)
I 1419.1420.
ReferenceOhnishi and Shibamoto, 1984Ohnishi and Shibamoto, 1984
Comment MSDC-RI MSDC-RI

References

Hanai and Hong, 1989
Hanai, T.; Hong, C., Structure-retention correlation in CGC, J. Hi. Res. Chromatogr., 1989, 12, 5, 327-332, https://doi.org/10.1002/jhrc.1240120517 . [all data]

Haken and Korhonen, 1984
Haken, J.K.; Korhonen, I.O.O., Gas chromatography of homologous esters. XXV. Capillary column studies of monochlorinated C5-C18 n-carboxylic esters, J. Chromatogr., 1984, 298, 89-100, https://doi.org/10.1016/S0021-9673(01)92697-4 . [all data]

Krupcik, Matisova, et al., 1982
Krupcik, J.; Matisova, E.; Garaj, J.; Sojak, L.; Brezkin, V.G., Contribution of adsorption to retention data in glass capillary gas chromatography. Part. I. Polar stationary phases, Chromatographia, 1982, 16, 1, 166-168, https://doi.org/10.1007/BF02258890 . [all data]

Moore and Brown, 1976
Moore, B.P.; Brown, W.V., 3,4,5-Trimethoxybenzylhydrazine - an efficient subtraction reagent for aldehydes and ketones in gas chromatography, J. Chromatogr., 1976, 121, 2, 279-284, https://doi.org/10.1016/S0021-9673(00)85024-4 . [all data]

Shashkova, Znamenskaia, et al., 1969
Shashkova, A.A.; Znamenskaia, A.P.; Pas'ko, L.Ya., Investigation of esters of odd series halohenated acids with Kovats indices, Gazovaya Khromatografiya, 1969, 9, 40-47. [all data]