2,3-Dimethyldecane

Phase change data

Data compiled as indicated in comments:
TRC - Thermodynamics Research Center, NIST Boulder Laboratories, Chris Muzny director
AC - William E. Acree, Jr., James S. Chickos

Quantity Value Units Method Reference Comment
Tfus196.6KN/APetrov, Sergienko, et al., 1959Uncertainty assigned by TRC = 2. K; TRC

Enthalpy of vaporization

ΔvapH (kJ/mol) Temperature (K) Method Reference Comment
50.0384.AStephenson and Malanowski, 1987Based on data from 369. - 480. K.; AC

In addition to the Thermodynamics Research Center (TRC) data available from this site, much more physical and chemical property data is available from the following TRC products:

References

Petrov, Sergienko, et al., 1959
Petrov, A.A.; Sergienko, S.R.; Tsedilina, A.L.; Nechitailo, N.A.; Sanin, P.I.; Nikitskaya, E.A., Izv. Akad. Nauk SSSR, 1959, 1959, 1421-4. [all data]

Stephenson and Malanowski, 1987
Stephenson, Richard M.; Malanowski, Stanislaw, Handbook of the Thermodynamics of Organic Compounds, 1987, https://doi.org/10.1007/978-94-009-3173-2 . [all data]