Oxacyclododecan-2-one

Reaction thermochemistry data

Data compiled by: Hussein Y. Afeefy, Joel F. Liebman, and Stephen E. Stein

Individual Reactions

11-hydroxyundecanoic acid = Oxacyclododecan-2-one + Water

By formula: C11H22O3 = C11H20O2 + H2O

Quantity Value Units Method Reference Comment
Δr8.91 ± 0.63kJ/molCmWiberg and Waldron, 1991solid phase

References

Wiberg and Waldron, 1991
Wiberg, K.B.; Waldron, R.F., Lactones. 2. Enthalpies of hydrolysis, reduction, and formation of the C4-C13 monocyclic lactones. strain energies and conformations, J. Am. Chem. Soc., 1991, 113, 7697-7705. [all data]