Triethylamine borane

Phase change data

Data compiled by: Eugene S. Domalski and Elizabeth D. Hearing

Enthalpy of fusion

ΔfusH (kJ/mol) Temperature (K) Reference Comment
14.9063269.48Finke, Todd, et al., 1970

Entropy of fusion

ΔfusS (J/mol*K) Temperature (K) Reference Comment
55.32269.48Finke, Todd, et al., 1970

References

Finke, Todd, et al., 1970
Finke, H.L.; Todd, S.S.; Messerly, J.F., Trimethylamineborane and triethylamineborane: low-temperature thermodynamic properties, J. Chem. Thermodynam., 1970, 2, 129-138. [all data]