Benzeneacetic acid, α-hydroxy-, (S)-

Condensed phase thermochemistry data

Data compiled by: Hussein Y. Afeefy, Joel F. Liebman, and Stephen E. Stein

Quantity Value Units Method Reference Comment
Δcsolid-3711. ± 0.8kJ/molCcbZubareva, Oberemok-Yakubova, et al., 1963Corresponding Δfsolid = -580.7 kJ/mol (simple calculation by NIST; no Washburn corrections)

Phase change data

Data compiled by: Thermodynamics Research Center, NIST Boulder Laboratories, Chris Muzny director

Quantity Value Units Method Reference Comment
Tfus393.7KN/ASmith, Alderman, et al., 1949Uncertainty assigned by TRC = 1. K

In addition to the Thermodynamics Research Center (TRC) data available from this site, much more physical and chemical property data is available from the following TRC products:

References

Zubareva, Oberemok-Yakubova, et al., 1963
Zubareva, N.D.; Oberemok-Yakubova, A.P.; Petrov, Yu.I.; Klabunovskii, E.I.; Balandin, A.A., Determination of the heats of combustion of DL- and L-mandelic acids, Bull. Acad. Sci. USSR, Div. Chem. Sci., 1963, 12, 2033-2034, In original 2207. [all data]

Smith, Alderman, et al., 1949
Smith, H.A.; Alderman, D.M.; Shacklett, C.D.; Welch, C.M., The Catalytic Hydrogenation of the Benzene Nucleus VI. The Hydrogenation of Compounds with Two Benzene Rings, J. Am. Chem. Soc., 1949, 71, 3772. [all data]