Cyclohexane, 1-bromo-2-fluoro-, trans-

Gas phase ion energetics data

Data compiled by: Sharon G. Lias, Rhoda D. Levin, and Sherif A. Kafafi

Ionization energy determinations

IE (eV) Method Reference Comment
10.18 ± 0.02PEBotter, Menes, et al., 1973
10.05PEGounelle, Menard, et al., 1975Vertical value

References

Botter, Menes, et al., 1973
Botter, R.; Menes, F.; Gounelle, Y.; Pechine, J.M.; Solgadi, D., The ionization potentials of geometrical isomers: the cis and trans 2-subststituted cyclopentyl and cyclohexyl bromides, Int. J. Mass Spectrom. Ion Phys., 1973, 12, 188. [all data]

Gounelle, Menard, et al., 1975
Gounelle, Y.; Menard, C.; Pechine, J.M.; Solgadi, D.; Menes, F.; Botter, R., Conformational effects on ionization potentials; Photoelectron spectra of dibromo- and bromofluoro- alkyl compounds, J. Electron Spectrosc. Relat. Phenom., 1975, 7, 247. [all data]