Anthracene, 2-chloro-

Phase change data

Data compiled by: William E. Acree, Jr., James S. Chickos

Enthalpy of sublimation

ΔsubH (kJ/mol) Temperature (K) Method Reference
99.3 ± 2.7331. - 371.MERibeiro da Silva, Schröder, et al., 2008

References

Ribeiro da Silva, Schröder, et al., 2008
Ribeiro da Silva, Manuel A.V.; Schröder, Bernd; Castro, Vasco B.M.; Santos, Luís M.N.B.F., Thermochemistry of Cu(II) and Ni(II) complexes with N,N-di-n-butyl-N´-thenoylthiourea and N,N-di-iso-butyl-N´-thenoylthiourea, The Journal of Chemical Thermodynamics, 2008, 40, 4, 599-606, https://doi.org/10.1016/j.jct.2007.11.008 . [all data]