Barium dicalcium propionate

Phase change data

Data compiled as indicated in comments:
TRC - Thermodynamics Research Center, NIST Boulder Laboratories, Chris Muzny director
DH - Eugene S. Domalski and Elizabeth D. Hearing

Quantity Value Units Method Reference Comment
Tfus268.4KN/AMomotani, Seki, et al., 1955Uncertainty assigned by TRC = 0.1 K; TRC

Enthalpy of fusion

ΔfusH (kJ/mol) Temperature (K) Reference Comment
7.284268.4Momotani, Seki, et al., 1955, 2DH

Entropy of fusion

ΔfusS (J/mol*K) Temperature (K) Reference Comment
27.2268.4Momotani, Seki, et al., 1955, 2DH

In addition to the Thermodynamics Research Center (TRC) data available from this site, much more physical and chemical property data is available from the following TRC products:

References

Momotani, Seki, et al., 1955
Momotani, M.; Seki, S.; Chihara, H.; Suga, H., Polymorphic phase transition of beryllium oyacetate Be4O(CH3CO2)6, Bull. Chem. Soc. Jpn., 1955, 28, 325. [all data]

Momotani, Seki, et al., 1955, 2
Momotani, M.; Seki, S.; Chihara, H.; Suga, H., Polymorphic phase transition of beryllium oxyacetate Be4O(CH3CO2)6, Bull. Chem. Soc. Japan, 1955, 28, 325-330. [all data]