Benzoyl chloride, 3-fluoro-

Phase change data

Data compiled as indicated in comments:
BS - Robert L. Brown and Stephen E. Stein
TRC - Thermodynamics Research Center, NIST Boulder Laboratories, Chris Muzny director

Quantity Value Units Method Reference Comment
Tboil462.KN/APCR Inc., 1990BS
Tboil462.2KN/AWeast and Grasselli, 1989BS
Quantity Value Units Method Reference Comment
Tfus282.KN/ABranch and Nixon, 1936Uncertainty assigned by TRC = 2. K; TRC

In addition to the Thermodynamics Research Center (TRC) data available from this site, much more physical and chemical property data is available from the following TRC products:

References

PCR Inc., 1990
PCR Inc., Research Chemicals Catalog 1990-1991, PCR Inc., Gainesville, FL, 1990, 1. [all data]

Weast and Grasselli, 1989
CRC Handbook of Data on Organic Compounds, 2nd Editon, Weast,R.C and Grasselli, J.G., ed(s)., CRC Press, Inc., Boca Raton, FL, 1989, 1. [all data]

Branch and Nixon, 1936
Branch, G.E.K.; Nixon, A.C., The Rate of Alcoholysis of Acyl Chlorides, J. Am. Chem. Soc., 1936, 58, 2499-2504. [all data]