2,4-Furandicarboxylic acid, dimethyl ester

Van Den Dool and Kratz RI, non-polar column, temperature ramp

View large format table.

Column type Active phase I Reference Comment
CapillaryDB-5MS1365.Cho, Namgung, et al., 200830. m/0.25 mm/0.25 μm, He, 40. C @ 1. min, 4. K/min, 200. C @ 10. min

Van Den Dool and Kratz RI, polar column, temperature ramp

View large format table.

Column type Active phase I Reference Comment
CapillaryDB-Wax2157.Cho, Namgung, et al., 200830. m/0.25 mm/0.25 μm, He, 40. C @ 1. min, 4. K/min, 200. C @ 10. min
CapillaryDB-Wax2157.Cho, Choi, et al., 200660. m/0.25 mm/0.25 μm, He, 40. C @ 1. min, 4. K/min, 200. C @ 10. min
CapillaryDB-Wax2153.Cho, Choi, et al., 200660. m/0.25 mm/0.25 μm, He, 40. C @ 1. min, 4. K/min, 200. C @ 10. min

References

Cho, Namgung, et al., 2008
Cho, I.H.; Namgung, H.-J.; Choi, H.-K.; Kim, Y.-S., Volatiles and key odorants in the pileus and stipe of pine-mushroom (Tricholoma matsutake Sing.), Food Chem., 2008, 106, 1, 71-76, https://doi.org/10.1016/j.foodchem.2007.05.047 . [all data]

Cho, Choi, et al., 2006
Cho, I.H.; Choi, H.-K.; Kim, Y.-S., Difference in the volatile composition of pine-mushrooms (Tricholoma matsutake Sing.) according to their grades, J. Agric. Food Chem., 2006, 54, 13, 4820-4825, https://doi.org/10.1021/jf0601416 . [all data]