Naphthalene, 1-(1,1-dimethylethyl)-

Phase change data

Data compiled by: Thermodynamics Research Center, NIST Boulder Laboratories, Chris Muzny director

Quantity Value Units Method Reference Comment
Tboil552.KN/ARomadane, 1957Uncertainty assigned by TRC = 4. K
Tboil551.KN/ALuther and Wachter, 1949Uncertainty assigned by TRC = 6. K
Tboil561.KN/ATsukervanik and Terent'eva, 1937Uncertainty assigned by TRC = 5. K

In addition to the Thermodynamics Research Center (TRC) data available from this site, much more physical and chemical property data is available from the following TRC products:

References

Romadane, 1957
Romadane, I., Zh. Obshch. Khim., 1957, 27, 1939. [all data]

Luther and Wachter, 1949
Luther, H.; Wachter, G., Preparation and physical properties of alkyl substituted naphthalene, Chem. Ber., 1949, 82, 161-176. [all data]

Tsukervanik and Terent'eva, 1937
Tsukervanik, I.P.; Terent'eva, I., Condensation of Alcahols with Aromatic Hydrocarbons in the Presence of Anhydrous ALuminum CHloride. IV. Condensation of ALiphatic Alcohols with Naphthalene, Zh. Obshch. Khim., 1937, 7, 637. [all data]