1,2,3,4-Tetrahydro-9-methylcarbazole

Phase change data

Data compiled by: William E. Acree, Jr., James S. Chickos

Enthalpy of vaporization

ΔvapH (kJ/mol) Temperature (K) Method Reference Comment
72.5400.EB,IPSteele, Chirico, et al., 1992Based on data from 370. - 655. K.
69.6440.EB,IPSteele, Chirico, et al., 1992Based on data from 370. - 655. K.
66.7480.EB,IPSteele, Chirico, et al., 1992Based on data from 370. - 655. K.
63.8520.EB,IPSteele, Chirico, et al., 1992Based on data from 370. - 655. K.
60.7560.EB,IPSteele, Chirico, et al., 1992Based on data from 370. - 655. K.
57.4600.EB,IPSteele, Chirico, et al., 1992Based on data from 370. - 655. K.
53.8640.EB,IPSteele, Chirico, et al., 1992Based on data from 370. - 655. K.

Enthalpy of fusion

ΔfusH (kJ/mol) Temperature (K) Reference
14.67323.8Steele, Chirico, et al., 1992

Gas phase thermochemistry data

Data compiled by: Hussein Y. Afeefy, Joel F. Liebman, and Stephen E. Stein

Quantity Value Units Method Reference Comment
Δfgas93.1 ± 0.4kJ/molCcbSteele, Chirico, et al., 1992

References

Steele, Chirico, et al., 1992
Steele, W.V.; Chirico, R.D.; Knipmeyer, S.E.; Nguyen, A., The thermodynamic properties of 9-methylcarbazole and of 1,2,3,4-tetrahydro-9-methylcarbzaole, J. Chem. Thermodyn., 1992, 24, 245-271. [all data]