1,3,8-Trimethylnaphthalene

Lee's RI, non-polar column, temperature ramp

View large format table.

Column type Active phase I Reference Comment
CapillaryDB-5MS261.68Sun, Zhou, et al., 200830. m/0.25 mm/0.25 μm, 50. C @ 2. min, 6. K/min, 300. C @ 16. min

References

Sun, Zhou, et al., 2008
Sun, P.; Zhou, Q.; Li, G.; Wang, X.; Zhao, Y.; Cao, L., fingerprint analysis of polycyclic aromatic hydrocarbons in crude oil by internal standard method, J. Instrumental Anal., 2008, 27, 4, 344-348. [all data]