1,1'-Biphenyl, 3,5-dimethyl-

Phase change data

Data compiled by: Thermodynamics Research Center, NIST Boulder Laboratories, Chris Muzny director

Quantity Value Units Method Reference Comment
Tboil552.KN/ACannon and Sutherland, 1951Uncertainty assigned by TRC = 5. K
Tboil548.KN/AHey and Jackson, 1934Uncertainty assigned by TRC = 4. K
Quantity Value Units Method Reference Comment
Tfus295.7KN/AJohnson, 1957Uncertainty assigned by TRC = 1.5 K

In addition to the Thermodynamics Research Center (TRC) data available from this site, much more physical and chemical property data is available from the following TRC products:

References

Cannon and Sutherland, 1951
Cannon, C.G.; Sutherland, G.B.B.M., The Infrared Absorption Spectra of Some Aromatic Compounds, Spectrochim. Acta, 1951, 4, 373. [all data]

Hey and Jackson, 1934
Hey, D.H.; Jackson, E.R.B., J. Chem. Soc., 1934, 1934, 645. [all data]

Johnson, 1957
Johnson, E.A., J. Chem. Soc., 1957, 1957, 4155. [all data]