Furan, 2-ethyl-5-methyl-

Van Den Dool and Kratz RI, polar column, custom temperature program

Data compiled by: NIST Mass Spectrometry Data Center, William E. Wallace, director

Column type CapillaryCapillaryCapillaryCapillaryCapillary
Active phase CP-Wax 52CBCarbowaxCarbowaxCarbowaxCarbowax
Column length (m) 60.
Carrier gas He
Substrate
Column diameter (mm) 0.250.30.30.30.3
Phase thickness (μm) 0.25
Program 40C => 5C/min => 60C => 2.5C/min => 155Cnot specifiednot specifiednot specifiednot specified
I 1028.1012.1013.1014.1015.
ReferenceAlasalvar, Shahidi, et al., 2003Baltes w. and Bochmann G., 1987Baltes w. and Bochmann G., 1987Baltes w. and Bochmann G., 1987Baltes w. and Bochmann G., 1987
Comment MSDC-RI MSDC-RI MSDC-RI MSDC-RI MSDC-RI
Column type CapillaryCapillaryCapillary
Active phase CarbowaxCarbowaxCarbowax 20M
Column length (m)   50.
Carrier gas
Substrate
Column diameter (mm) 0.30.30.3
Phase thickness (μm)
Program not specifiednot specifiednot specified
I 1015.1018.1014.
ReferenceBaltes w. and Bochmann G., 1987Baltes w. and Bochmann G., 1987Baltes and Bochmann, 1987
Comment MSDC-RI MSDC-RI MSDC-RI

Normal alkane RI, polar column, temperature ramp

Data compiled by: NIST Mass Spectrometry Data Center, William E. Wallace, director

Column type CapillaryCapillaryCapillaryCapillary
Active phase InnowaxFFAPFFAPSupelcowax-10
Column length (m) 30.30.30.60.
Carrier gas HeliumNitrogenN2He
Substrate
Column diameter (mm) 0.250.320.320.25
Phase thickness (μm) 0.250.500.50.25
Tstart (C) 40.35.35.40.
Tend (C) 250.250.320.175.
Heat rate (K/min) 8.4.4.1.
Initial hold (min) 1.5.5.5.
Final hold (min) 2.7545.45.
I 1032.1034.1034.1014.
ReferenceSiristova, Prinosilova, et al., 2012Budryn, Nebesny, et al., 2011Nebesny, Budryn, et al., 2007Hsieh, Williams, et al., 1989
Comment MSDC-RI MSDC-RI MSDC-RI MSDC-RI

Normal alkane RI, non-polar column, custom temperature program

Data compiled by: NIST Mass Spectrometry Data Center, William E. Wallace, director

Column type CapillaryCapillaryCapillaryCapillary
Active phase Polydimethyl siloxane with 5 % Ph groupsPolydimethyl siloxane with 5 % Ph groupsSLB-5MSSE-30
Column length (m)   10.
Carrier gas   Helium
Substrate
Column diameter (mm)   0.18
Phase thickness (μm)   0.18
Program not specifiednot specifiednot specifiednot specified
I 800.802.791.791.
ReferenceRobinson, Adams, et al., 2012Robinson, Adams, et al., 2012Risticevic, Carasek, et al., 2008Vinogradov, 2004
Comment MSDC-RI MSDC-RI MSDC-RI MSDC-RI

References

Alasalvar, Shahidi, et al., 2003
Alasalvar, C.; Shahidi, F.; Cadwallader, K.R., Comparison of natural and roasted Turkish Tombul hazelnut (Corylus avellana L.) volatiles and flavor by DHA/GC/MS and descriptive sensory analysis, J. Agric. Food Chem., 2003, 51, 17, 5067-5072, https://doi.org/10.1021/jf0300846 . [all data]

Baltes w. and Bochmann G., 1987
Baltes w.; Bochmann G., Model reactions on roast aroma formation. II. Mass spectrometric identification of furans and furanones from the reaction of serine and threonine with sucrose under the conditions of coffee roasting, Z. Lebensm. Unters. Forsch., 1987, 184, 179-186. [all data]

Baltes and Bochmann, 1987
Baltes, W.; Bochmann, G., Model reactions on roast aroma formation. 1. Reaction of serine and threonine with sucrose under the conditions of coffee roasting and identification of new coffee aroma compounds, J. Agric. Food Chem., 1987, 35, 3, 340-346, https://doi.org/10.1021/jf00075a015 . [all data]