Rhenium heptafluoride

Gas phase ion energetics data

Data compiled as indicated in comments:
LLK - Sharon G. Lias, Rhoda D. Levin, and Sherif A. Kafafi

Ionization energy determinations

IE (eV) Method Reference Comment
14.1 ± 0.1PEVovna, Dudin, et al., 1979LLK

References

Vovna, Dudin, et al., 1979
Vovna, V.I.; Dudin, A.S.; Avkhutskii, L.M.; Lopatin, S.N.; Ippolitov, E.G., Photoelectron spectra and electronic spectra of volatile rhenium fluorides [and oxide fluorides], Russ. J. Inorg. Chem., 1979, 24, 1135. [all data]