Benzene, 1-methyl-4-(1,2,2-trimethylcyclopentyl)-, (R)-

Kovats' RI, non-polar column, custom temperature program

Data compiled by: NIST Mass Spectrometry Data Center, William E. Wallace, director

Column type Capillary
Active phase SF-96
Column length (m) 150.
Carrier gas
Substrate
Column diameter (mm) 0.75
Phase thickness (μm)
Program not specified
I 1506.
ReferenceMalingré and Maarse, 1974
Comment MSDC-RI

Normal alkane RI, non-polar column, custom temperature program

Data compiled by: NIST Mass Spectrometry Data Center, William E. Wallace, director

Column type CapillaryCapillaryCapillaryCapillaryCapillary
Active phase HP-5HP-5DB-5HP-5 MSSE-52
Column length (m)   30.30.25.
Carrier gas   HeliumHeliumH2
Substrate
Column diameter (mm)   0.250.250.32
Phase thickness (μm)   0.250.250.42
Program not specifiednot specified50 0C m6 0C/min -> 140 0C 5 0C/min -> 160 0C (1 min) 10 0C/min -> 200 0Cnot specified60C(8min) => 3C/min => 180C => 20C/min => 250C (10min)
I 1498.1511.1517.1499.1500.
ReferenceCitron, Riclea, et al., 2011Citron, Riclea, et al., 2011Courtois, Paine, et al., 2009Sharififar, Mozaffarian, et al., 2007Lorenzo, Loayza, et al., 2006
Comment MSDC-RI MSDC-RI MSDC-RI MSDC-RI MSDC-RI
Column type CapillaryCapillaryCapillaryCapillaryCapillary
Active phase HP-5MSHP-5MSOV-1DB-5SE-30
Column length (m) 30.30.30.30.
Carrier gas HeHeHeHe
Substrate
Column diameter (mm) 0.250.250.250.25
Phase thickness (μm) 0.250.250.250.25
Program 40C (2min) => 10C/min => 200C => 15C/min => 250C (5min)40C (2min) => 10C/min => 200C => 15C/min => 250C (5min)45 0C (4 min) 3 0C/min -> 75 0C 4 0C/min -> 115 0C 6 0C/min -> 312 0C40C(1min) => 9C/min => 130C => 2C/min => 230Cnot specified
I 1523.1523.1489.1503.1510.
ReferenceDemyttenaere, Moriña, et al., 2004Demyttenaere, Moriña, et al., 2004Hafez and Abdel-Salam, 2004Hamm, Bleton, et al., 2004Vinogradov, 2004
Comment MSDC-RI MSDC-RI MSDC-RI MSDC-RI MSDC-RI
Column type Capillary
Active phase Methyl Silicone
Column length (m)
Carrier gas
Substrate
Column diameter (mm)
Phase thickness (μm)
Program not specified
I 1510.
ReferenceZenkevich, 1996
Comment MSDC-RI

Normal alkane RI, polar column, custom temperature program

Data compiled by: NIST Mass Spectrometry Data Center, William E. Wallace, director

Column type CapillaryCapillaryCapillaryCapillaryCapillary
Active phase InnowaxHP Innowax FSPHP-Innowax FSCCarbowax 20MInnowax
Column length (m) 60.60.60. 60.
Carrier gas  HeliumHe He
Substrate
Column diameter (mm) 0.250.250.25 0.25
Phase thickness (μm) 0.330.250.25 0.25
Program not specified60 0C (10 min) 4 0C/min -> 220 0C (10 min) 1 0C/min -> 240 0C (20 min)60C(10min) => 4C/min => 220C(10min) => 1C/min => 240Cnot specified60C(10min) => 4C/min => 220C(10min) => 1C/min => 240C (20min)
I 1822.1849.1849.1827.1849.
ReferenceNoorizadeh, Farmany, et al., 2011Wedge, Klun, et al., 2009Sezik E., Kocakulak E., et al., 2005Vinogradov, 2004Tunaher, Kirimer, et al., 2003
Comment MSDC-RI MSDC-RI MSDC-RI MSDC-RI MSDC-RI
Column type CapillaryCapillaryCapillary
Active phase InnowaxDB-WaxNB-351
Column length (m) 60.30.25.
Carrier gas HeHeHe
Substrate
Column diameter (mm) 0.250.250.32
Phase thickness (μm) 0.250.250.2
Program 60C(10min) => 4C/min => 200C(10min) => 1C/min => 240C25C(8min) => 4C/min => 60C => 6C/min => 160C => 20C/min => 200C35C(5min) => 2.5C/min => 150C => 5C/min => 240C (20min)
I 1849.1818.1787.
ReferenceÖzcan, Akgül, et al., 2001Caldentey, Daria Fumi, et al., 1998Kerrola and Kallio, 1994
Comment MSDC-RI MSDC-RI MSDC-RI

References

Malingré and Maarse, 1974
Malingré, T.M.; Maarse, H., Composition of the essential oil of Mentha aquatica, Phytochemistry, 1974, 13, 8, 1531-1535, https://doi.org/10.1016/0031-9422(74)80322-5 . [all data]