BH4-

Vibrational and/or electronic energy levels

Data compiled by: Marilyn E. Jacox

State:   x

Vib.
sym.
 No.   Approximate
 type of mode
 cm-1   Med.   Method   References

f2 3 BH stretch 2212.8 Ar IR Tague and Andrews, 1994

Additional references: Jacox, 1998, page 266

References

Tague and Andrews, 1994
Tague, T.J., Jr.; Andrews, L., Reactions of Pulsed-Laser Evaporated Boron Atoms with Hydrogen. Infrared Spectra of Boron Hydride Intermediate Species in Solid Argon, J. Am. Chem. Soc., 1994, 116, 11, 4970, https://doi.org/10.1021/ja00090a048 . [all data]

Jacox, 1998
Jacox, M.E., Vibrational and electronic energy levels of polyatomic transient molecules: supplement A, J. Phys. Chem. Ref. Data, 1998, 27, 2, 115-393, https://doi.org/10.1063/1.556017 . [all data]