2,2-Diphenyl-4,4,6,6-tetramethylcyclotrisiloxane

Phase change data

Data compiled as indicated in comments:
TRC - Thermodynamics Research Center, NIST Boulder Laboratories, Chris Muzny director
AC - William E. Acree, Jr., James S. Chickos
DH - Eugene S. Domalski and Elizabeth D. Hearing

Quantity Value Units Method Reference Comment
Ttriple337.98KN/AKuliev, Dzhafarov, et al., 1982Uncertainty assigned by TRC = 0.01 K; TRC

Enthalpy of vaporization

ΔvapH (kcal/mol) Temperature (K) Reference Comment
16.0481.Ditsent, Skorokhodov, et al., 1974Based on data from 439. - 523. K.; AC

Enthalpy of fusion

ΔfusH (kcal/mol) Temperature (K) Reference Comment
5.304338.Domalski and Hearing, 1996AC

Enthalpy of phase transition

ΔHtrs (kcal/mol) Temperature (K) Initial Phase Final Phase Reference Comment
5.3040337.98crystaline, IliquidKuliev, Dzhafarov, et al., 1982, 2DH

Entropy of phase transition

ΔStrs (cal/mol*K) Temperature (K) Initial Phase Final Phase Reference Comment
15.7337.98crystaline, IliquidKuliev, Dzhafarov, et al., 1982, 2DH

In addition to the Thermodynamics Research Center (TRC) data available from this site, much more physical and chemical property data is available from the following TRC products:

References

Kuliev, Dzhafarov, et al., 1982
Kuliev, A.M.; Dzhafarov, O.I.; Karasharli, K.A.; Kostryukov, V.N., Heat capacity and thermodynamic functions of cyclic methylphenylsiloxanes, Zh. Fiz. Khim., 1982, 56, 310-13. [all data]

Ditsent, Skorokhodov, et al., 1974
Ditsent, V.E.; Skorokhodov, I.I.; Terent'eva, N.A.; Zolotareva, M.N., Russ. J. Phys. Chem., 1974, 48, 447. [all data]

Domalski and Hearing, 1996
Domalski, Eugene S.; Hearing, Elizabeth D., Heat Capacities and Entropies of Organic Compounds in the Condensed Phase. Volume III, J. Phys. Chem. Ref. Data, 1996, 25, 1, 1, https://doi.org/10.1063/1.555985 . [all data]

Kuliev, Dzhafarov, et al., 1982, 2
Kuliev, A.M.; Dzhafarov, O.I.; Karasharli, K.A.; Kostryukov, V.N., Heat capacity and thermodynamic functions of cyclic methylphenylsiloxanes, Zhur. Fiz. Khim., 1982, 56, 310-313. [all data]