Hexyl tiglate

Van Den Dool and Kratz RI, non-polar column, temperature ramp

Data compiled by: NIST Mass Spectrometry Data Center, William E. Wallace, director

Column type CapillaryCapillaryCapillaryCapillaryCapillary
Active phase VF-5MSDB-5HP-5MSHP-5HP-5
Column length (m) 30.30.30.30.30.
Carrier gas HeN2HeHeHe
Substrate
Column diameter (mm) 0.250.250.250.250.25
Phase thickness (μm) 0.250.250.25 0.25
Tstart (C) 60.60.60.60.60.
Tend (C) 270.240.280.260.280.
Heat rate (K/min)  3.4.3.4.
Initial hold (min)  3.5. 5.
Final hold (min)  3.
I 1330.1335.1331.1331.1331.
ReferenceLiang, 2010Dob, Dahmane, et al., 2006Saroglou, Dorizas, et al., 2006Javidnia, Miri, et al., 2005Skaltsa, Demetzos, et al., 2003
Comment MSDC-RI MSDC-RI MSDC-RI MSDC-RI MSDC-RI
Column type CapillaryCapillaryCapillaryCapillary
Active phase RTX-5RTX-5HP-5HP-5
Column length (m) 30.30.30.30.
Carrier gas HeHe He
Substrate
Column diameter (mm) 0.250.250.320.25
Phase thickness (μm) 0.250.250.250.25
Tstart (C) 45.45.40.50.
Tend (C) 250.250.280.280.
Heat rate (K/min) 3.3.3.4.
Initial hold (min) 6.6.4.5.
Final hold (min)
I 1331.1337.1330.1330.
ReferenceShellie, Mondello, et al., 2002Shellie, Mondello, et al., 2002Ruther, 2000Lazari, Skaltsa, et al., 1999
Comment MSDC-RI MSDC-RI MSDC-RI MSDC-RI

Normal alkane RI, polar column, custom temperature program

Data compiled by: NIST Mass Spectrometry Data Center, William E. Wallace, director

Column type CapillaryCapillaryCapillaryCapillary
Active phase HP-Innowax FSCHP Innowax FSPCarbowax 20MInnowax FSC
Column length (m) 60.60. 60.
Carrier gas HeN2 Helium
Substrate
Column diameter (mm) 0.250.25 0.25
Phase thickness (μm) 0.250.25 0.25
Program 60(10min) => 4C/min => 220C(10min) => 1C/min => 240C60C(10min) => 4C/min => 220C(10min) => 1C/min => 240Cnot specified60 0C (10 min) 4 0C/min -> 220 0C (10 min) 1 0C/min -> 240 0C
I 1631.1631.1621.1631.
ReferenceSuleimenov Y.M., Atazhanova G.A., et al., 2006Altintas, Kose, et al., 2004Vinogradov, 2004Kirimer, Tabanca, et al., 1999
Comment MSDC-RI MSDC-RI MSDC-RI MSDC-RI

References

Liang, 2010
Liang, Y., Retention Data. NIST Mass Spectrometry Data Center., NIST Mass Spectrometry Data Center, 2010. [all data]

Dob, Dahmane, et al., 2006
Dob, T.; Dahmane, D.; Agli, M.; Chelghoum, C., Essential oil composition of Lavandula stoechas from Algeria, Pharm. Biol., 2006, 44, 1, 60-64, https://doi.org/10.1080/13880200500496421 . [all data]

Saroglou, Dorizas, et al., 2006
Saroglou, V.; Dorizas, N.; Kypriotakis, Z.; Skaltsa, H.D., Analysis of the essential oil composition of eight Anthemis species from Greece, J. Chromatogr. A, 2006, 1104, 1-2, 313-322, https://doi.org/10.1016/j.chroma.2005.11.087 . [all data]

Javidnia, Miri, et al., 2005
Javidnia, K.; Miri, R.; Jamalian, A., Composition of the essential oil of Salvia macrosiphon Boiss. from Iran, Flavour Fragr. J., 2005, 20, 5, 542-543, https://doi.org/10.1002/ffj.1468 . [all data]

Skaltsa, Demetzos, et al., 2003
Skaltsa, H.D.; Demetzos, C.; Lazari, D.; Sokovic, M., Essential oil analysis and antimicrobial activity of eight Stachys species from Greece, Phytochemistry, 2003, 64, 3, 743-752, https://doi.org/10.1016/S0031-9422(03)00386-8 . [all data]

Shellie, Mondello, et al., 2002
Shellie, R.; Mondello, L.; Marriott, P.; Dugo, G., Characterisation of lavender essential oils by using gas chromatography-mass spectrometry with correlation of linear retention indices and comparison with comprehensive two-dimensional gas chromatography, J. Chromatogr. A, 2002, 970, 1-2, 225-234, https://doi.org/10.1016/S0021-9673(02)00653-2 . [all data]

Ruther, 2000
Ruther, J., Retention index database for identification of general green leaf volatiles in plants coupled capillary gas chromatography-mass spectrometry, J. Chromatogr. A, 2000, 890, 2, 313-319, https://doi.org/10.1016/S0021-9673(00)00618-X . [all data]

Lazari, Skaltsa, et al., 1999
Lazari, D.M.; Skaltsa, H.D.; Constantinidis, T., Essential oils of Marrubium velutinum Sm. and Marrubium peregrinum L., growing wild in Greece, Flavour Fragr. J., 1999, 14, 5, 290-292, https://doi.org/10.1002/(SICI)1099-1026(199909/10)14:5<290::AID-FFJ828>3.0.CO;2-4 . [all data]