N,N,N',N'-Tetrafluoro-4-methyl-1,2-pentanediamine

Condensed phase thermochemistry data

Data compiled by: Hussein Y. Afeefy, Joel F. Liebman, and Stephen E. Stein

Quantity Value Units Method Reference Comment
Δfliquid-264.9kJ/molCcrGood, Douslin, et al., 1962Corrected for CODATA value of ΔfH; HF(1:50) H2O; see Good, Douslin, et al., 1963
Quantity Value Units Method Reference Comment
Δcliquid-4519.3 ± 3.3kJ/molCcrGood, Douslin, et al., 1962Corrected for CODATA value of ΔfH; HF(1:50) H2O; see Good, Douslin, et al., 1963

References

Good, Douslin, et al., 1962
Good, W.D.; Douslin, D.R.; McCullough, J.P., 1,2-Bis-difluoroamino-1-methylpentane:heats of formation, and vaporization; and vapor pressure, J. Phys. Chem., 1962, 66, 958-959. [all data]

Good, Douslin, et al., 1963
Good, W.D.; Douslin, D.R.; McCullough, J.P., 1,2-Bis-difluoroamino-4-methylpentane: Heats of combustion, formation, and vaporization; vapor pressure; and N-F thermochemical bond energy, J. Phys. Chem., 1963, 67, 1312-1314. [all data]