Indan, 3a,7a-dihydro-

Reaction thermochemistry data

Data compiled by: Hussein Y. Afeefy, Joel F. Liebman, and Stephen E. Stein

Individual Reactions

C9H12N2O = Nitrous oxide + Indan, 3a,7a-dihydro-

By formula: C9H12N2O = N2O + C9H12

Quantity Value Units Method Reference Comment
Δr-0.71 ± 0.12kcal/molKinOth, Olsen, et al., 1977liquid phase; solvent: THF

References

Oth, Olsen, et al., 1977
Oth, J.F.M.; Olsen, H.; Synder, J.P., Energetics of heteroextrusion reactions. N2 vs. N2O, J. Am. Chem. Soc., 1977, 99, 8505-8507. [all data]