Mercuric hexadecanoate

Phase change data

Data compiled as indicated in comments:
TRC - Thermodynamics Research Center, NIST Boulder Laboratories, Chris Muzny director
DH - Eugene S. Domalski and Elizabeth D. Hearing

Quantity Value Units Method Reference Comment
Tfus390.3KN/AAdeosun, 1978Crystal phase 1 phase; Uncertainty assigned by TRC = 0.2 K; TRC

Enthalpy of phase transition

ΔHtrs (kJ/mol) Temperature (K) Initial Phase Final Phase Reference Comment
49.500383.4crystaline, IIcrystaline, IAdeosun, 1978, 2c,I probably a smectic phase.; DH
59.500390.3crystaline, IliquidAdeosun, 1978, 2DH

Entropy of phase transition

ΔStrs (J/mol*K) Temperature (K) Initial Phase Final Phase Reference Comment
129.1383.4crystaline, IIcrystaline, IAdeosun, 1978, 2c,I; DH
152.4390.3crystaline, IliquidAdeosun, 1978, 2DH

In addition to the Thermodynamics Research Center (TRC) data available from this site, much more physical and chemical property data is available from the following TRC products:

References

Adeosun, 1978
Adeosun, S.O., A differential thermal analysis study of phase transitions in some mercury(II) carboxylates, J. Thermal Anal., 1978, 14, 235-43. [all data]

Adeosun, 1978, 2
Adeosun, S.O., A differential thermal analysis study of phase transitions in some mercury(II) carboxylates, J. Thermal Anal., 1978, 14, 235-243. [all data]