5-ethyl-o-cresol

Phase change data

Data compiled by: Thermodynamics Research Center, NIST Boulder Laboratories, Chris Muzny director

Quantity Value Units Method Reference Comment
Tboil498. ± 4.KAVGN/AAverage of 7 values; Individual data points
Quantity Value Units Method Reference Comment
Tfus287.15KN/AKarr, 1957Uncertainty assigned by TRC = 2. K
Tfus281.15KN/ASy and Lejeune, 1957Uncertainty assigned by TRC = 8. K
Tfus288.95KN/AKruber, Raeithel, et al., 1955Uncertainty assigned by TRC = 2. K
Tfus287.15KN/AWhite, 1954Uncertainty assigned by TRC = 2. K
Tfus287.15KN/AKruber and Lauenstein, 1948Uncertainty assigned by TRC = 2. K

In addition to the Thermodynamics Research Center (TRC) data available from this site, much more physical and chemical property data is available from the following TRC products:

References

Karr, 1957
Karr, C., , U. S. Bur. Mines, Inform. Circ. IC 7802, 1957. [all data]

Sy and Lejeune, 1957
Sy, M.; Lejeune, G., The Phenols of Coal Tar, Chim. Ind. (Paris), 1957, 78, 619. [all data]

Kruber, Raeithel, et al., 1955
Kruber, O.; Raeithel, A.; Grigoleit, G., Compounds Proved to Be Present in Coal Tar, Erdoel Kohle, 1955, 8, 637. [all data]

White, 1954
White, E.N., 5th Tar Conf. Coal Tar Res. Assoc. Rept. 0124, 1954, England, 1954. [all data]

Kruber and Lauenstein, 1948
Kruber, O.; Lauenstein, Chem. Ber., 1948, 81, 221. [all data]