1,3,5,7-Tetramethyl-adamantane

Kovats' RI, non-polar column, isothermal

Data compiled by: NIST Mass Spectrometry Data Center, William E. Wallace, director

Column type CapillaryCapillaryCapillaryCapillaryCapillary
Active phase SqualaneSqualaneSqualaneSqualaneApiezon L
Column length (m)     50.
Carrier gas     N2
Substrate
Column diameter (mm)     0.2
Phase thickness (μm)
Temperature (C) 100.110.125.140.140.
I 1162.1169.1176.1185.1214.
ReferenceBogoslovsky, Anvaer, et al., 1978Bogoslovsky, Anvaer, et al., 1978Bogoslovsky, Anvaer, et al., 1978Bogoslovsky, Anvaer, et al., 1978Hála, Eyem, et al., 1970
Comment MSDC-RI MSDC-RI MSDC-RI MSDC-RI MSDC-RI
Column type CapillaryCapillaryCapillary
Active phase SqualaneSqualaneSqualane
Column length (m) 50.50.50.
Carrier gas N2N2N2
Substrate
Column diameter (mm) 0.20.20.2
Phase thickness (μm)
Temperature (C) 110.125.140.
I 1169.1176.1185.
ReferenceHála, Eyem, et al., 1970Hála, Eyem, et al., 1970Hála, Eyem, et al., 1970
Comment MSDC-RI MSDC-RI MSDC-RI

Gas phase thermochemistry data

Data compiled by: Hussein Y. Afeefy, Joel F. Liebman, and Stephen E. Stein

Quantity Value Units Method Reference Comment
Δfgas-68.0 ± 1.7kcal/molCcbClark, Knox, et al., 1979Reanalyzed by Pedley, Naylor, et al., 1986, Original value = -67.15 ± 0.50 kcal/mol; Gas flow technique for Hs, see Clark, Knox, et al., 1975
Δfgas-67.4 ± 1.7kcal/molCcbSteele and Watt, 1977Reanalyzed by Pedley, Naylor, et al., 1986, Original value = -70.5 ± 0.9 kcal/mol

Condensed phase thermochemistry data

Data compiled by: Hussein Y. Afeefy, Joel F. Liebman, and Stephen E. Stein

Quantity Value Units Method Reference Comment
Δfsolid-86.54 ± 0.46kcal/molCcbClark, Knox, et al., 1979Gas flow technique for Hs, see Clark, Knox, et al., 1975
Δfsolid-90.5 ± 0.9kcal/molCcbSteele and Watt, 1977
Quantity Value Units Method Reference Comment
Δcsolid-2049.95 ± 0.47kcal/molCcbClark, Knox, et al., 1979Gas flow technique for Hs, see Clark, Knox, et al., 1975; Corresponding Δfsolid = -86.55 kcal/mol (simple calculation by NIST; no Washburn corrections)
Δcsolid-2046.0 ± 0.9kcal/molCcbSteele and Watt, 1977Corresponding Δfsolid = -90.5 kcal/mol (simple calculation by NIST; no Washburn corrections)

References

Bogoslovsky, Anvaer, et al., 1978
Bogoslovsky, Yu.N.; Anvaer, B.I.; Vigdergauz, M.S., Chromatographic constants in gas chromatography (in Russian), Standards Publ. House, Moscow, 1978, 192. [all data]

Hála, Eyem, et al., 1970
Hála, S.; Eyem, J.; Burkhard, J.; Landa, S., Retention indices of adamantanes, J. Chromatogr. Sci., 1970, 8, 4, 203-209, https://doi.org/10.1093/chromsci/8.4.203 . [all data]