1,3-Dimethyl-5-ethyladamantane

Kovats' RI, non-polar column, isothermal

View large format table.

Column type Active phase Temperature (C) I Reference Comment
CapillarySE-30190.1313.Sarkisova and Pimerzin, 2005He; Column length: 50. m; Column diameter: 0.2 mm
CapillarySE-30145.1279.Bogoslovsky, Anvaer, et al., 1978
CapillarySqualane100.1263.Bogoslovsky, Anvaer, et al., 1978
CapillarySqualane110.1267.Bogoslovsky, Anvaer, et al., 1978
CapillarySqualane125.1276.Bogoslovsky, Anvaer, et al., 1978
CapillarySqualane140.1287.Bogoslovsky, Anvaer, et al., 1978
CapillarySqualane100.1263.Mitra, Mohan, et al., 1974H2; Column length: 50. m; Column diameter: 0.2 mm
CapillaryApiezon L140.1321.Hála, Eyem, et al., 1970N2; Column length: 50. m; Column diameter: 0.2 mm
CapillarySqualane110.1267.Hála, Eyem, et al., 1970N2; Column length: 50. m; Column diameter: 0.2 mm
CapillarySqualane125.1276.Hála, Eyem, et al., 1970N2; Column length: 50. m; Column diameter: 0.2 mm
CapillarySqualane140.1285.Hála, Eyem, et al., 1970N2; Column length: 50. m; Column diameter: 0.2 mm
CapillarySE-30145.1279.Burkhard, Vais, et al., 1969N2; Column length: 50. m; Column diameter: 0.27 mm
CapillarySE-30160.1291.Burkhard, Vais, et al., 1969N2; Column length: 50. m; Column diameter: 0.27 mm
CapillarySE-30175.1303.Burkhard, Vais, et al., 1969N2; Column length: 50. m; Column diameter: 0.27 mm
CapillarySE-30190.1313.Burkhard, Vais, et al., 1969N2; Column length: 50. m; Column diameter: 0.27 mm

Kovats' RI, non-polar column, temperature ramp

View large format table.

Column type Active phase I Reference Comment
CapillaryHP-5MS1252.Yang, Wang, et al., 200630. m/0.25 mm/0.25 μm, 50. C @ 2. min, 6. K/min; Tend: 300. C

Kovats' RI, polar column, isothermal

View large format table.

Column type Active phase Temperature (C) I Reference Comment
CapillaryCarbowax 20M145.1406.Burkhard, Vais, et al., 1969N2; Column length: 50. m; Column diameter: 0.27 mm
CapillaryCarbowax 20M160.1421.Burkhard, Vais, et al., 1969N2; Column length: 50. m; Column diameter: 0.27 mm
CapillaryCarbowax 20M175.1441.Burkhard, Vais, et al., 1969N2; Column length: 50. m; Column diameter: 0.27 mm

Normal alkane RI, non-polar column, custom temperature program

View large format table.

Column type Active phase I Reference Comment
CapillaryPolydimethyl siloxane1279.Bayat and Abad, 2011Program: not specified
CapillaryPolydimethyl siloxane1279.Bayat and Abad M.F.Y., 2011Program: not specified

References

Sarkisova and Pimerzin, 2005
Sarkisova, V.S.; Pimerzin, A.A., Gas chromatographic characteristics and boiling points of diadamantanes, Pet. Chem. USSR (Engl. Transl.), 2005, 45, 1, 63-66. [all data]

Bogoslovsky, Anvaer, et al., 1978
Bogoslovsky, Yu.N.; Anvaer, B.I.; Vigdergauz, M.S., Chromatographic constants in gas chromatography (in Russian), Standards Publ. House, Moscow, 1978, 192. [all data]

Mitra, Mohan, et al., 1974
Mitra, G.D.; Mohan, G.; Sinha, A., Gas chromatographic analysis of complex hydrocarbon mixtures, J. Chromatogr. A, 1974, 91, 633-648, https://doi.org/10.1016/S0021-9673(01)97944-0 . [all data]

Hála, Eyem, et al., 1970
Hála, S.; Eyem, J.; Burkhard, J.; Landa, S., Retention indices of adamantanes, J. Chromatogr. Sci., 1970, 8, 4, 203-209, https://doi.org/10.1093/chromsci/8.4.203 . [all data]

Burkhard, Vais, et al., 1969
Burkhard, J.; Vais, J.; Vodicka, L.; Landa, S., Adamantane and its derivatives. XVI. The gas chromatographic characterization of adamantane derivatives, J. Chromatogr., 1969, 42, 207-218, https://doi.org/10.1016/S0021-9673(01)80617-8 . [all data]

Yang, Wang, et al., 2006
Yang, C.; Wang, Z.D.; Hollebone, B.P.; Peng, X.; Fingas, M.; Landriault, M., GC/MS Quantitation of diamondoid compounds in crude oils and petroleum products, Environmental Forensics, 2006, 7, 4, 377-390, https://doi.org/10.1080/15275920600996396 . [all data]

Bayat and Abad, 2011
Bayat, Z.; Abad, M.F.Y., Quantitative structure-property relationship (QSPR) study of Kovats retention indices of some of adamantane derivatives by the genetic algorithm amd nultiply linear regression (GA-MLR) method, Petroleum Coal, 2011, 53, 2, 132-140. [all data]

Bayat and Abad M.F.Y., 2011
Bayat, Z.; Abad M.F.Y., Computational approaches to the prediction of the Kovats retention index (RI) for adamantane derivatives (AD) as a drug, J. Chem. Pharm. Res., 2011, 3, 1, 48-55. [all data]