1,2-Dicarbadodecaborane(12)

Phase change data

Data compiled by: William E. Acree, Jr., James S. Chickos

Quantity Value Units Method Reference Comment
Δsub15.6 ± 0.24kcal/molN/APilcher and Skinner, 1983See also Miroshnichenko, Pavlovich, et al., 1976.

Enthalpy of sublimation

ΔsubH (kcal/mol) Temperature (K) Method Reference Comment
12.0318.AStephenson and Malanowski, 1987Based on data from 283. - 333. K.
11.8348.AStephenson and Malanowski, 1987Based on data from 333. - 423. K.

References

Pilcher and Skinner, 1983
Pilcher, G.; Skinner, H.A., Thermochemistry of organometallic compounds, 1983, 43-90, https://doi.org/10.1002/9780470771686.ch2 . [all data]

Miroshnichenko, Pavlovich, et al., 1976
Miroshnichenko, E.A.; Pavlovich, V.K.; Lebedev, Yu.A.; Stanko, V.I.; Gal'chenko, G.L., Microcalorimetric determination of enthalpies of sublimation of carboranes, Termodin. Org. Soedin, 1976, 5, 3. [all data]

Stephenson and Malanowski, 1987
Stephenson, Richard M.; Malanowski, Stanislaw, Handbook of the Thermodynamics of Organic Compounds, 1987, https://doi.org/10.1007/978-94-009-3173-2 . [all data]