2(1H)-Pyridinone, 3-hydroxy-

Phase change data

Data compiled by: William E. Acree, Jr., James S. Chickos

Quantity Value Units Method Reference Comment
Δsub26.1 ± 1.0kcal/molCMorais, Miranda, et al., 2006

References

Morais, Miranda, et al., 2006
Morais, Victor M.F.; Miranda, Margarida S.; Matos, M. Agostinha R., Experimental and computational thermochemistry of the dihydroxypyridine isomers, The Journal of Chemical Thermodynamics, 2006, 38, 4, 450-454, https://doi.org/10.1016/j.jct.2005.06.013 . [all data]