2-Amino-3-hydroxypyridine

Reaction thermochemistry data

Data compiled by: John E. Bartmess

Individual Reactions

C5H5N2O- + Hydrogen cation = 2-Amino-3-hydroxypyridine

By formula: C5H5N2O- + H+ = C5H6N2O

Quantity Value Units Method Reference Comment
Δr1427. ± 12.kJ/molG+TSBreuker, Knochenmuss, et al., 1999gas phase; Acid: 2-amino-3-hydroxypyridine
Quantity Value Units Method Reference Comment
Δr1398. ± 11.kJ/molIMRBBreuker, Knochenmuss, et al., 1999gas phase; Acid: 2-amino-3-hydroxypyridine

References

Breuker, Knochenmuss, et al., 1999
Breuker, K.; Knochenmuss, R.; Zenobi, R., Gas-phase basicities of deprotonated matrix-assisted laser desorption/ionization matrix molecules, Int. J. Mass Spectrom., 1999, 184, 1, 25-38, https://doi.org/10.1016/S1387-3806(98)14200-8 . [all data]