bis(acetonitrile)tetracarbonyltungsten

Phase change data

Data compiled by: William E. Acree, Jr., James S. Chickos

Quantity Value Units Method Reference Comment
Δsub31.3 ± 1.4kcal/molN/ACavell, Ernsting, et al., 1980Based on data from 294. - 313. K.

References

Cavell, Ernsting, et al., 1980
Cavell, K.J.; Ernsting, J.M.; Stufkens, D.J., Sublimation enthalpies of the complexes W(CO)6-x(NCCH3)x (x=1,2,3) and Mo(CO)6-x(NCCH3x(x=1,3), Thermochimica Acta, 1980, 42, 3, 343-348, https://doi.org/10.1016/0040-6031(80)85095-7 . [all data]