Mono-methyl terephthalate

Phase change data

Data compiled by: William E. Acree, Jr., James S. Chickos

Quantity Value Units Method Reference Comment
Δsub29.66 ± 0.24kcal/molMEMonte and Sousa, 2005Based on data from 363. - 381. K.

Enthalpy of sublimation

ΔsubH (kcal/mol) Temperature (K) Method Reference Comment
28.9 ± 0.1372.3MEMonte and Sousa, 2005Based on data from 363. - 381. K.
17.2448.N/AStephenson and Malanowski, 1987Based on data from 433. - 493. K.
19.8473.GSKraus, Beranek, et al., 1962Based on data from 433. - 493. K.

Enthalpy of fusion

ΔfusH (kcal/mol) Temperature (K) Method Reference
9.00692.5DSCMonte and Sousa, 2005

References

Monte and Sousa, 2005
Monte, Manuel J.S.; Sousa, Carlos A.D., Vapor Pressures and Phase Changes Enthalpy and Gibbs Energy of Three Crystalline Monomethyl Benzenedicarboxylates, J. Chem. Eng. Data, 2005, 50, 6, 2101-2105, https://doi.org/10.1021/je0503305 . [all data]

Stephenson and Malanowski, 1987
Stephenson, Richard M.; Malanowski, Stanislaw, Handbook of the Thermodynamics of Organic Compounds, 1987, https://doi.org/10.1007/978-94-009-3173-2 . [all data]

Kraus, Beranek, et al., 1962
Kraus, M.; Beranek, L.; Kochloeff, K.; Bazant, V., Chem. Prum., 1962, 12, 649. [all data]