2(3H)-Furanone, dihydro-4-methyl-

Van Den Dool and Kratz RI, non-polar column, temperature ramp

Data compiled by: NIST Mass Spectrometry Data Center, William E. Wallace, director

Column type CapillaryCapillaryCapillary
Active phase DB-1DB-1DB-1
Column length (m) 60.60.60.
Carrier gas HeHeHe
Substrate
Column diameter (mm) 0.2480.2480.248
Phase thickness (μm) 0.250.250.25
Tstart (C) 50.50.50.
Tend (C) 250.250.250.
Heat rate (K/min) 5.5.5.
Initial hold (min)
Final hold (min)
I 913.914.916.
ReferenceLee, DeMilo, et al., 1997Lee, DeMilo, et al., 1997Lee, DeMilo, et al., 1997
Comment MSDC-RI MSDC-RI MSDC-RI

References

Lee, DeMilo, et al., 1997
Lee, C.-J.; DeMilo, A.B.; Moreno, D.S.; Mangan, R.L., Identification of the volatile components of E802 Mazoferm steepwater, a condensed fermented corn extractive highly attractive to the Mexican fruit fly (Diptera: Tephritidae), J. Agric. Food Chem., 1997, 45, 6, 2327-2331, https://doi.org/10.1021/jf960632y . [all data]