2(3H)-Furanone, dihydro-3-methyl-

Normal alkane RI, non-polar column, temperature ramp

Data compiled by: NIST Mass Spectrometry Data Center, William E. Wallace, director

Column type CapillaryCapillaryCapillary
Active phase HP-5DB-1DB-1
Column length (m) 60.50.50.
Carrier gas He
Substrate
Column diameter (mm) 0.320.320.32
Phase thickness (μm) 0.25
Tstart (C) 30.0.50.
Tend (C) 260.250.250.
Heat rate (K/min) 2.3.3.
Initial hold (min) 2.
Final hold (min) 28.
I 957.4941.941.
ReferenceLeffingwell and Alford, 2005Habu, Flath, et al., 1985Habu, Flath, et al., 1985
Comment MSDC-RI MSDC-RI MSDC-RI

References

Leffingwell and Alford, 2005
Leffingwell, J.C.; Alford, E.D., Volatile constituents of Perique tobacco, Electron. J. Environ. Agric. Food Chem., 2005, 4, 2, 899-915. [all data]

Habu, Flath, et al., 1985
Habu, T.; Flath, R.A.; Mon, T.R.; Morton, J.F., Volatile components of Rooibos tea (Aspalathus linearis), J. Agric. Food Chem., 1985, 33, 2, 249-254, https://doi.org/10.1021/jf00062a024 . [all data]