Cyclohexane, 1,3-diethyl

Phase change data

Data compiled by: Thermodynamics Research Center, NIST Boulder Laboratories, Chris Muzny director

Quantity Value Units Method Reference Comment
Tboil445.7KN/AAllinger and Hu, 1962Uncertainty assigned by TRC = 2. K
Tboil447.2KN/ASignaigo and Cramer, 1933Uncertainty assigned by TRC = 2. K

In addition to the Thermodynamics Research Center (TRC) data available from this site, much more physical and chemical property data is available from the following TRC products:

Kovats' RI, non-polar column, isothermal

View large format table.

Column type Active phase Temperature (C) I Reference Comment
CapillarySqualane100.1000.Mitra, Mohan, et al., 1974H2; Column length: 50. m; Column diameter: 0.2 mm
PackedSE-30130.1017.Mitra and Saha, 1970N2
PackedMethyl Silicone130.1017.Antheaume and Guiochon, 1965

References

Allinger and Hu, 1962
Allinger, N.L.; Hu, S., Conformational Analysis XXI. The Ethyl Group, J. Am. Chem. Soc., 1962, 84, 370-2. [all data]

Signaigo and Cramer, 1933
Signaigo, F.K.; Cramer, P.L., The preparation of some mono- and dialkylcylohexanes, J. Am. Chem. Soc., 1933, 55, 3326-32. [all data]

Mitra, Mohan, et al., 1974
Mitra, G.D.; Mohan, G.; Sinha, A., Gas chromatographic analysis of complex hydrocarbon mixtures, J. Chromatogr. A, 1974, 91, 633-648, https://doi.org/10.1016/S0021-9673(01)97944-0 . [all data]

Mitra and Saha, 1970
Mitra, G.D.; Saha, N.C., Determination of Retention Indices of Saturated Hydrocarbons by Graphical Methods, J. Chromatogr. Sci., 1970, 8, 2, 95-102, https://doi.org/10.1093/chromsci/8.2.95 . [all data]

Antheaume and Guiochon, 1965
Antheaume, J.; Guiochon, G., Application de la chromatographie en phase gazeuse à l'étude de la composition des fractions moyennes d'un brut pétrolier, Bull. Soc. Chim. Fr., 1965, 2, 298-307. [all data]