Moretenol

Normal alkane RI, non-polar column, custom temperature program

View large format table.

Column type Active phase I Reference Comment
CapillaryHP-53120.Yasar, Üçüncü, et al., 200530. m/0.25 mm/0.25 μm, He; Program: 60C(5min) => 3C/min => 120C (2min) => 2C/min => 200C (2min) => 3C/min => 320C

References

Yasar, Üçüncü, et al., 2005
Yasar, A.; Üçüncü, O.; Güleç, C.; Inceer, H.; Ayaz, S.; Yayh, N., GC-MS analysis of chloroform extracts in flowers, stems, and roots of Tripleurospermum callosum, Pharm. Biol., 2005, 43, 2, 108-112, https://doi.org/10.1080/13880200590919384 . [all data]