1-Ethyl-1,2,4-triazole

Kovats' RI, non-polar column, isothermal

View large format table.

Column type Active phase Temperature (C) I Reference Comment
CapillaryOV-101110.900.Golovnya, Kuz'menko, et al., 2000He; Phase thickness: 0.4 μm

References

Golovnya, Kuz'menko, et al., 2000
Golovnya, R.V.; Kuz'menko, T.E.; Krikunova, N.I., The influence of alkyl substituents on the chromatographic indicator of self-association of N-containing heterocyclic compounds, Russ. Chem. Bull. (Engl. Transl.), 2000, 49, 2, 321-324, https://doi.org/10.1007/BF02494681 . [all data]