Cyclohexane, 1,4-dichloro-, cis-

Phase change data

Data compiled by: Thermodynamics Research Center, NIST Boulder Laboratories, Chris Muzny director

Quantity Value Units Method Reference Comment
Tfus291.KN/ALunney, Whaley, et al., 1952Uncertainty assigned by TRC = 3. K

In addition to the Thermodynamics Research Center (TRC) data available from this site, much more physical and chemical property data is available from the following TRC products:

Normal alkane RI, non-polar column, temperature ramp

View large format table.

Column type Active phase I Reference Comment
CapillaryOV-1011084.Zenkevich, Eliseenkov, et al., 200925. m/0.20 mm/0.25 μm, Nitrogen, 6. K/min; Tstart: 60. C; Tend: 240. C
CapillaryOV-1011084.Zenkevich, Eliseenkov, et al., 200925. m/0.20 mm/0.25 μm, Nitrogen, 6. K/min; Tstart: 60. C; Tend: 240. C
CapillaryOV-1011084.Zenkevich, Eliseenkov, et al., 200925. m/0.20 mm/0.25 μm, Nitrogen, 6. K/min; Tstart: 60. C; Tend: 240. C

Normal alkane RI, non-polar column, custom temperature program

View large format table.

Column type Active phase I Reference Comment
CapillaryOV-1, SE-30, Methyl silicone, SP-2100, OV-101, DB-1, etc.1106.Waggott and Davies, 1984Hydrogen; Column length: 50. m; Column diameter: 0.32 mm; Program: not specified

References

Lunney, Whaley, et al., 1952
Lunney, T.W.; Whaley, A.M.; Davis, H.W., cis-1,4-Dichlorocylohexane, J. Am. Chem. Soc., 1952, 74, 3428-9. [all data]

Zenkevich, Eliseenkov, et al., 2009
Zenkevich, I.G.; Eliseenkov, E.V.; Kasatochkin, A.N., Chromatographic Identification of Cyclohexane Chlorination Products by an Additive Scheme for the Prediction of Retention Indices, Chromatographia, 2009, 70, 5/6, 839-849, https://doi.org/10.1365/s10337-009-1213-x . [all data]

Waggott and Davies, 1984
Waggott, A.; Davies, I.W., Identification of organic pollutants using linear temperature programmed retention indices (LTPRIs) - Part II, 1984, retrieved from http://dwi.defra.gov.uk/research/completed-research/reports/dwi0383.pdf. [all data]