2,6-Octadiene, 2,7-dimethyl-

Phase change data

Data compiled by: Thermodynamics Research Center, NIST Boulder Laboratories, Chris Muzny director

Quantity Value Units Method Reference Comment
Tboil441.KN/AStevens and Spalding, 1949Uncertainty assigned by TRC = 2. K
Tboil441.8KN/AHenne and Chanan, 1944Uncertainty assigned by TRC = 2. K
Tboil435.KN/APetrov and Sanin, 1939Uncertainty assigned by TRC = 5. K
Quantity Value Units Method Reference Comment
Tfus198.8KN/AHenne and Chanan, 1944Uncertainty assigned by TRC = 2. K

In addition to the Thermodynamics Research Center (TRC) data available from this site, much more physical and chemical property data is available from the following TRC products:

References

Stevens and Spalding, 1949
Stevens, P.G.; Spalding, S.C., A New Synthesis of the Cyclopentane Ring with Notes on the Biological Origin of Terpenes and Sterols, J. Am. Chem. Soc., 1949, 71, 1687. [all data]

Henne and Chanan, 1944
Henne, A.L.; Chanan, H.H., Diolefins from Allylic Chlorides II., J. Am. Chem. Soc., 1944, 66, 392. [all data]

Petrov and Sanin, 1939
Petrov, A.D.; Sanin, P.S., Synthesis and Dehydration of Bisecondary and Bitertiary Glycols of the Series CnH2n+2O2, Zh. Obshch. Khim., 1939, 9, 2129. [all data]