Cholest-4-ene

Phase change data

Data compiled by: Thermodynamics Research Center, NIST Boulder Laboratories, Chris Muzny director

Quantity Value Units Method Reference Comment
Tfus355.KN/ATurner, Meador, et al., 1957Uncertainty assigned by TRC = 5. K
Tfus351.KN/AHuang-Minlon, 1949Uncertainty assigned by TRC = 5. K

In addition to the Thermodynamics Research Center (TRC) data available from this site, much more physical and chemical property data is available from the following TRC products:

References

Turner, Meador, et al., 1957
Turner, R.B.; Meador, W.R.; Winkler, R.E., Heats of Hydrogenation II. Heats of Hydrogenation and the Acid-catalyzed Isomerization of Some Unsaturated Steroids, J. Am. Chem. Soc.Q 79, 1957, 4122-27. [all data]

Huang-Minlon, 1949
Huang-Minlon, Reduction of Steroid Ketones and Other Carbonyl Compounds by Modified Wolff-Kishner Method, J. Am. Chem. Soc., 1949, 71, 3301. [all data]