Cobalt anion

Gas phase thermochemistry data

Data compiled as indicated in comments:
B - John E. Bartmess

Quantity Value Units Method Reference Comment
Δfgas360.7 ± 2.1kJ/molR-EAScheer, Brodie, et al., 1998B
Quantity Value Units Method Reference Comment
gas,1 bar178.41J/mol*KReviewChase, 1998Data last reviewed in June, 1984

Reaction thermochemistry data

Data compiled by: John E. Bartmess

Individual Reactions

Co- + Hydrogen cation = HCo

By formula: Co- + H+ = HCo

Quantity Value Units Method Reference Comment
Δr1411. ± 25.kJ/molD-EAScheer, Brodie, et al., 1998gas phase
Quantity Value Units Method Reference Comment
Δr1395. ± 13.kJ/molIMRBSallans, Lane, et al., 1985gas phase

References

Scheer, Brodie, et al., 1998
Scheer, M.; Brodie, C.A.; Bilodeau, R.C.; Haugen, H.K., Laser spectroscopic measurements of binding energies and fine-structure splittings of Co-, Ni-, Rh-, and Pd-, Phys. Rev. A, 1998, 58, 3, 2051-2062, https://doi.org/10.1103/PhysRevA.58.2051 . [all data]

Chase, 1998
Chase, M.W., Jr., NIST-JANAF Themochemical Tables, Fourth Edition, J. Phys. Chem. Ref. Data, Monograph 9, 1998, 1-1951. [all data]

Sallans, Lane, et al., 1985
Sallans, L.; Lane, K.R.; Squires, R.R.; Freiser, B.S., Generation and reactions of atomic metal anions in the gas phase. Determination of the heterolytic and homolytic bond energies of VH, VrH, FeH, CoH, and MoH, J. Am. Chem. Soc., 1985, 107, 4379. [all data]