Molybdenum ion (1+)

Gas phase thermochemistry data

Quantity Value Units Method Reference Comment
gas,1 bar180.67J/mol*KReviewChase, 1998Data last reviewed in March, 1984

Reaction thermochemistry data

Data compiled by: Robert C. Dunbar

Individual Reactions

Molybdenum ion (1+) + Carbon monosulfide = (Molybdenum ion (1+) • Carbon monosulfide)

By formula: Mo+ + CS = (Mo+ • CS)

Quantity Value Units Method Reference Comment
Δr162. ± 13.kJ/molCIDTSchroeder, Kretzschmar, et al., 2003
Δr162. ± 18.kJ/molCIDTRodgers and Armentrout, 2000

(Molybdenum ion (1+) • Sulfur dimer) + Sulfur dimer = (Molybdenum ion (1+) • 2Sulfur dimer)

By formula: (Mo+ • S2) + S2 = (Mo+ • 2S2)

Quantity Value Units Method Reference Comment
Δr300. ± 13.kJ/molCIDTSchroeder, Kretzschmar, et al., 2003

Molybdenum ion (1+) + Sulfur dimer = (Molybdenum ion (1+) • Sulfur dimer)

By formula: Mo+ + S2 = (Mo+ • S2)

Quantity Value Units Method Reference Comment
Δr329. ± 10.kJ/molCIDTSchroeder, Kretzschmar, et al., 2003

Molybdenum ion (1+) + Carbon disulfide = (Molybdenum ion (1+) • Carbon disulfide)

By formula: Mo+ + CS2 = (Mo+ • CS2)

Quantity Value Units Method Reference Comment
Δr67. ± 13.kJ/molCIDTSchroeder, Kretzschmar, et al., 2003

Molybdenum ion (1+) + Pyrrole = (Molybdenum ion (1+) • Pyrrole)

By formula: Mo+ + C4H5N = (Mo+ • C4H5N)

Quantity Value Units Method Reference Comment
Δr>290.kJ/molRAKGapeev and Yang, 2000

Ion clustering data

Data compiled by: Robert C. Dunbar

Clustering reactions

Molybdenum ion (1+) + Carbon monosulfide = (Molybdenum ion (1+) • Carbon monosulfide)

By formula: Mo+ + CS = (Mo+ • CS)

Quantity Value Units Method Reference Comment
Δr162. ± 13.kJ/molCIDTSchroeder, Kretzschmar, et al., 2003
Δr162. ± 18.kJ/molCIDTRodgers and Armentrout, 2000

Molybdenum ion (1+) + Carbon disulfide = (Molybdenum ion (1+) • Carbon disulfide)

By formula: Mo+ + CS2 = (Mo+ • CS2)

Quantity Value Units Method Reference Comment
Δr67. ± 13.kJ/molCIDTSchroeder, Kretzschmar, et al., 2003

Molybdenum ion (1+) + Pyrrole = (Molybdenum ion (1+) • Pyrrole)

By formula: Mo+ + C4H5N = (Mo+ • C4H5N)

Quantity Value Units Method Reference Comment
Δr>290.kJ/molRAKGapeev and Yang, 2000

Molybdenum ion (1+) + Sulfur dimer = (Molybdenum ion (1+) • Sulfur dimer)

By formula: Mo+ + S2 = (Mo+ • S2)

Quantity Value Units Method Reference Comment
Δr329. ± 10.kJ/molCIDTSchroeder, Kretzschmar, et al., 2003

(Molybdenum ion (1+) • Sulfur dimer) + Sulfur dimer = (Molybdenum ion (1+) • 2Sulfur dimer)

By formula: (Mo+ • S2) + S2 = (Mo+ • 2S2)

Quantity Value Units Method Reference Comment
Δr300. ± 13.kJ/molCIDTSchroeder, Kretzschmar, et al., 2003

References

Chase, 1998
Chase, M.W., Jr., NIST-JANAF Themochemical Tables, Fourth Edition, J. Phys. Chem. Ref. Data, Monograph 9, 1998, 1-1951. [all data]

Schroeder, Kretzschmar, et al., 2003
Schroeder, D.; Kretzschmar, I.; Schwarz; Armentrout, P.B., Structure, Thermochemistry, and Reactivityof MSn+ Cations (M=V,Mo; n=1-3) in the Gas Phase, Int. J. Mass Spectrom., 2003, 228, 2-3, 439, https://doi.org/10.1016/S1387-3806(03)00137-4 . [all data]

Rodgers and Armentrout, 2000
Rodgers, M.T.; Armentrout, P.B., Noncovalent Metal-Ligand Bond Energies as Studied by Threshold Collision-Induced Dissociation, Mass Spectrom. Rev., 2000, 19, 4, 215, https://doi.org/10.1002/1098-2787(200007)19:4<215::AID-MAS2>3.0.CO;2-X . [all data]

Gapeev and Yang, 2000
Gapeev, A.; Yang, C.-N., Binding Energies of Gas-Phase Ions with Pyrrole. Experimental and Quantum Chemical Results, J. Phys. Chem. A, 2000, 104, 14, 3246, https://doi.org/10.1021/jp992627d . [all data]