9-Tetradecen-1-ol, acetate, (Z)-

Phase change data

Data compiled by: William E. Acree, Jr., James S. Chickos

Quantity Value Units Method Reference Comment
Δvap89.1kJ/molGCKoutek, Hoskovec, et al., 1997Based on data from 353. - 398. K. See also Ova, Koultek, et al., 2000.

Enthalpy of vaporization

ΔvapH (kJ/mol) Temperature (K) Method Reference Comment
90.0310.GCOlsson, J«65533»nsson, et al., 1983Based on data from 303. - 317. K.

References

Koutek, Hoskovec, et al., 1997
Koutek, Bohumír; Hoskovec, Michal; Vrkocová, Pavlína; Feltl, Ladislav, Gas chromatographic determination of vapour pressures of pheromone-like compounds IV. Acetates, a reinvestigation, Journal of Chromatography A, 1997, 759, 1-2, 93-109, https://doi.org/10.1016/S0021-9673(96)00775-3 . [all data]

Ova, Koultek, et al., 2000
Ova, P.V.; Koultek, B.; Hoskovec, M., Practice Oriented Results on Use and Production of Neem Ingredients and Pheromones VI, H. Kleeberg and C.P.W. Zebitz, ed(s)., Druck and Graphic, Giessen, 2000, 211-218. [all data]

Olsson, J«65533»nsson, et al., 1983
Olsson, Anne-Marie; J«65533»nsson, Jan «65533»ke; Thelin, Bernt; Liljefors, Tommy, Determination of the vapor pressures of moth sex pheromone components by a gas chromatographic method, J Chem Ecol, 1983, 9, 3, 375-385, https://doi.org/10.1007/BF00988456 . [all data]