dihexadecylamine

Phase change data

Data compiled by: Thermodynamics Research Center, NIST Boulder Laboratories, Chris Muzny director

Quantity Value Units Method Reference Comment
Tfus340.18KN/AHoerr, Harwood, et al., 1946Uncertainty assigned by TRC = 0.5 K
Tfus337.65KN/AUeno and Takase, 1941Uncertainty assigned by TRC = 4. K
Tfus337.15KN/AUeno, Takase, et al., 1941Uncertainty assigned by TRC = 4. K
Tfus338.15KN/AWestphal and Jerchel, 1940Uncertainty assigned by TRC = 4. K
Tfus338.65KN/AStaudinger and Roessler, 1936Uncertainty assigned by TRC = 4. K

In addition to the Thermodynamics Research Center (TRC) data available from this site, much more physical and chemical property data is available from the following TRC products:

References

Hoerr, Harwood, et al., 1946
Hoerr, C.W.; Harwood, H.J.; Ralston, A.W., Dimorphism of Symmetrical Normal Aliphatic Secondary Amines of High Molecular Weight., J. Org. Chem., 1946, 11, 199. [all data]

Ueno and Takase, 1941
Ueno, S.; Takase, S., Reduction of Aliphatic Acid Amides Under High Pressure., Kogyo Kagaku Zasshi, 1941, 44, 30. [all data]

Ueno, Takase, et al., 1941
Ueno, S.; Takase, S.; Tazima, Y., Reduction of Fatty Acid Amides Under High Pressure. III. Reduction of Anilides., Kogyo Kagaku Zasshi, 1941, 44, 58. [all data]

Westphal and Jerchel, 1940
Westphal, O.; Jerchel, D., Reaction of Higher 1-Chloroparaffins With Ammonia, Primary, Secondary, and Tertiary Amines., Chem. Ber., 1940, 73, 1002. [all data]

Staudinger and Roessler, 1936
Staudinger, H.; Roessler, K., Highly Polymerized Compounds. CXXIII. Viscosity Measurements on Long- Chain Aliphatic Amines., Chem. Ber., 1936, 69B, 49-60. [all data]