Phosphorane, triphenyl(phenylmethylene)-

Gas phase ion energetics data

Data compiled by: Sharon G. Lias, Rhoda D. Levin, and Sherif A. Kafafi

Ionization energy determinations

IE (eV) Method Reference Comment
6.01PEStarzewski and Bock, 1976Vertical value

References

Starzewski and Bock, 1976
Starzewski, K.A.O.; Bock, H., Photoelectron spectra and molecular properties. 58.1,2 Phosphorus ylides: Gas phase ionization potentials and charge distribution, J. Am. Chem. Soc., 1976, 98, 8486. [all data]