1-Pentanone, 1-(4-methylphenyl)-

Gas phase ion energetics data

Data compiled by: Sharon G. Lias, Rhoda D. Levin, and Sherif A. Kafafi

Ionization energy determinations

IE (eV) Method Reference Comment
9.02PEKoenig, Wielesek, et al., 1977Vertical value

References

Koenig, Wielesek, et al., 1977
Koenig, T.; Wielesek, R.; Miller, L.L.; So, Y.-H., Correlation of electrochemical reactivity and photoelectron spectra of aromatic ketones, J. Am. Chem. Soc., 1977, 99, 7061. [all data]