ThH2

Vibrational and/or electronic energy levels

Data compiled by: Marilyn E. Jacox

State:   X

Vib.
sym.
 No.   Approximate
 type of mode
 cm-1   Med.   Method   References

a1 1 Sym. stretch 1480.1 Ar IR Souter, Kushto, et al., 1997
b2 3 Asym. stretch 1455.6 Ar IR Souter, Kushto, et al., 1997
Liang, Andrews, et al., 2002

Additional references: Jacox, 1998, page 128

References

Souter, Kushto, et al., 1997
Souter, P.F.; Kushto, G.P.; Andrews, L.; Neurock, M., Experimental and Theoretical Evidence for the Isolation of Thorium Hydride Molecules in Argon Matrices, J. Phys. Chem. A, 1997, 101, 7, 1287, https://doi.org/10.1021/jp962863d . [all data]

Liang, Andrews, et al., 2002
Liang, B.; Andrews, L.; Li, J.; Bursten, B.E., Experimental and Theoretical Studies of the Products of Laser-Ablated Thorium Atom Reactions with H, J. Am. Chem. Soc., 2002, 124, 23, 6723, https://doi.org/10.1021/ja012593z . [all data]

Jacox, 1998
Jacox, M.E., Vibrational and electronic energy levels of polyatomic transient molecules: supplement A, J. Phys. Chem. Ref. Data, 1998, 27, 2, 115-393, https://doi.org/10.1063/1.556017 . [all data]