(E)-5-dodecenyl acetate

Phase change data

Data compiled by: William E. Acree, Jr., James S. Chickos

Quantity Value Units Method Reference Comment
Δvap19.1kcal/molGCKoutek, Hoskovec, et al., 1997Based on data from 333. - 378. K. See also Ova, Koultek, et al., 2000.

Van Den Dool and Kratz RI, non-polar column, temperature ramp

View large format table.

Column type Active phase I Reference Comment
CapillaryHP-51597.Shalit, Katzir, et al., 2001He, 50. C @ 1. min, 4. K/min; Column length: 30. m; Column diameter: 0.25 mm; Tend: 200. C
CapillaryDB-51597.Marques, McElfresh, et al., 200030. m/0.25 mm/0.25 μm, 100. C @ 1. min, 5. K/min, 275. C @ 3. min

Normal alkane RI, polar column, isothermal

View large format table.

Column type Active phase Temperature (C) I Reference Comment
CapillaryPEG160.1962.Guo, Yuan, et al., 1984Column length: 30. m; Column diameter: 0.36 mm
CapillaryFFAP210.1958.Guo, Yuan, et al., 1984Column length: 80. m; Column diameter: 0.30 mm

References

Koutek, Hoskovec, et al., 1997
Koutek, Bohumír; Hoskovec, Michal; Vrkocová, Pavlína; Feltl, Ladislav, Gas chromatographic determination of vapour pressures of pheromone-like compounds IV. Acetates, a reinvestigation, Journal of Chromatography A, 1997, 759, 1-2, 93-109, https://doi.org/10.1016/S0021-9673(96)00775-3 . [all data]

Ova, Koultek, et al., 2000
Ova, P.V.; Koultek, B.; Hoskovec, M., Practice Oriented Results on Use and Production of Neem Ingredients and Pheromones VI, H. Kleeberg and C.P.W. Zebitz, ed(s)., Druck and Graphic, Giessen, 2000, 211-218. [all data]

Shalit, Katzir, et al., 2001
Shalit, M.; Katzir, N.; Tadmor, Y.; Larkov, O.; Burger, Y.; Shalekhet, F.; Lastochkin, E.; Ravid, U.; Amar, O.; Edelstein, M.; Karchi, Z.; Lewinsohn, E., Acetyl-CoA: alcohol acetyltransferase activity and aroma formation in ripening melon fruits, J. Agric. Food Chem., 2001, 49, 2, 794-799, https://doi.org/10.1021/jf001075p . [all data]

Marques, McElfresh, et al., 2000
Marques, F.A.; McElfresh, J.S.; Millar, J.G., Kováts retention indexes of monounsaturated C12, C14, and C16 alcohols, acetates and aldehydes commonly found in lepidopteran pheromone blends, J. Braz. Chem. Soc., 2000, 11, 6, 592-599, https://doi.org/10.1590/S0103-50532000000600007 . [all data]

Guo, Yuan, et al., 1984
Guo, G.; Yuan, M.; Lin, G., Study on the resolution of geometric isomers of insect sex pheromones with capillary column GC, You ji hua xue, 1984, 5, 349-354. [all data]