cis-Alpha,beta-penteneoic acid

Condensed phase thermochemistry data

Data compiled by: Hussein Y. Afeefy, Joel F. Liebman, and Stephen E. Stein

Quantity Value Units Method Reference Comment
Δcliquid-962.2kcal/molCmSchjanberg, 1938Corresponding Δfliquid = 218.7 kcal/mol (simple calculation by NIST; no Washburn corrections)

Phase change data

Data compiled by: Thermodynamics Research Center, NIST Boulder Laboratories, Chris Muzny director

Quantity Value Units Method Reference Comment
Tc655.46KN/AD'Souza and Teja, 1987Uncertainty assigned by TRC = 3. K; Ambrose's procedure
Quantity Value Units Method Reference Comment
Pc39.5596atmN/AD'Souza and Teja, 1987Uncertainty assigned by TRC = 0.987 atm; Ambrose's procedure

In addition to the Thermodynamics Research Center (TRC) data available from this site, much more physical and chemical property data is available from the following TRC products:

References

Schjanberg, 1938
Schjanberg, E., Cis-pentensyreetylestrarnas forbranningsvarmen, refraktionsdata och alkaliska hydrolys, Svensk. Kim. Tidr., 1938, 50, 102-106. [all data]

D'Souza and Teja, 1987
D'Souza, R.; Teja, A.S., The prediction of the vapor pressures of carboxylic acids, Chem. Eng. Commun., 1987, 61, 13. [all data]