Phenanthrene, 1,3-dimethyl-

Lee's RI, non-polar column, custom temperature program

Data compiled by: NIST Mass Spectrometry Data Center, William E. Wallace, director

Column type CapillaryCapillaryCapillary
Active phase DB-5CP Sil 8 CBCP Sil 8 CB
Column length (m) 30.50.50.
Carrier gas HeHeHe
Substrate
Column diameter (mm) 0.250.250.25
Phase thickness (μm) 0.250.250.25
Program 90C (1min) => 10C/min => 120C => 4C/min => 310C (20min)not specifiednot specified
I 339.65340.6341.5
ReferenceZamperlini, Silva, et al., 1997Bundt, Herbel, et al., 1991Bundt, Herbel, et al., 1991
Comment MSDC-RI MSDC-RI MSDC-RI

Lee's RI, non-polar column, temperature ramp

Data compiled by: NIST Mass Spectrometry Data Center, William E. Wallace, director

Column type CapillaryCapillaryCapillaryCapillary
Active phase HP-5DB-5CP Sil 8 CBCP Sil 8 CB
Column length (m) 30.30.50.50.
Carrier gas HeliumHeHeH2
Substrate
Column diameter (mm) 0.250.320.250.22
Phase thickness (μm) 0.250.250.250.13
Tstart (C) 50.50.80.120.
Tend (C) 310.300.300.270.
Heat rate (K/min) 6.6.4.3.
Initial hold (min) 1.52. 2.
Final hold (min) 10.
I 340.79341.75341.4340.00
ReferencePedersen, Durant, et al., 2005Wang, Fingas, et al., 1994Bundt, Herbel, et al., 1991Garrigues, Parlanti, et al., 1987
Comment MSDC-RI MSDC-RI MSDC-RI MSDC-RI

References

Zamperlini, Silva, et al., 1997
Zamperlini, G.C.M.; Silva, M.R.S.; Vilegas, W., Identification of polycyclic aromatic hydrocarbons in sugar cane soot by gas chromatography-mass spectrometry, Chromatographia, 1997, 46, 11/12, 655-663, https://doi.org/10.1007/BF02490527 . [all data]

Bundt, Herbel, et al., 1991
Bundt, J.; Herbel, W.; Steinhart, H.; Franke, S.; Francke, W., Structure-type separation of diesel fuels by solid phase extraction and identification of the two- and three-ring aromatics by capillary GC-mass spectrometry, J. Hi. Res. Chromatogr., 1991, 14, 2, 91-98, https://doi.org/10.1002/jhrc.1240140205 . [all data]