3-Isopropyl-6,8a-dimethyl-1,2,4,5,8,8a-hexahydroazulene

Kovats' RI, non-polar column, temperature ramp

Data compiled by: NIST Mass Spectrometry Data Center, William E. Wallace, director

Column type CapillaryCapillary
Active phase SE-54DB-5
Column length (m) 30.30.
Carrier gas HeHe
Substrate
Column diameter (mm) 0.260.25
Phase thickness (μm) 0.250.25
Tstart (C) 60.60.
Tend (C) 246.240.
Heat rate (K/min) 3.4.
Initial hold (min)
Final hold (min)
I 1380.1378.
ReferenceAdams, 2000da Silva, Zoghbi, et al., 1999
Comment MSDC-RI MSDC-RI

Normal alkane RI, non-polar column, temperature ramp

Data compiled by: NIST Mass Spectrometry Data Center, William E. Wallace, director

Column type CapillaryCapillaryCapillaryCapillaryCapillary
Active phase RTX-1CP-Sil 5 CBDB-5Methyl SiliconeDB-1
Column length (m) 60.30.30.50.50.
Carrier gas HeliumNitrogenHeliumHeliumHe
Substrate
Column diameter (mm) 0.220.250.250.250.25
Phase thickness (μm) 0.250.250.25 0.25
Tstart (C) 60.50.45.50.95.
Tend (C) 230.200.250.240.240.
Heat rate (K/min) 2.5.3.3.4.
Initial hold (min)   3.
Final hold (min) 5. 5.
I 1380.1384.1387.1380.1370.
ReferenceBendiabdellah, El Amine Dib, et al., 2012Hnawia, Menut, et al., 2009Porto, Decorti, et al., 2009Ozcan and Chalchat, 2007Pala-Paul, Brophy, et al., 2007
Comment MSDC-RI MSDC-RI MSDC-RI MSDC-RI MSDC-RI
Column type CapillaryCapillaryCapillaryCapillaryCapillary
Active phase DB-5DB-5DB-1DB-1CP Sil 5 CB
Column length (m) 30.30.50.50.25.
Carrier gas HeHeliumN2N2He
Substrate
Column diameter (mm) 0.250.250.250.250.25
Phase thickness (μm) 0.250.250.250.250.4
Tstart (C) 40.60.95.95.60.
Tend (C) 260.260.240.240.260.
Heat rate (K/min) 4.3.4.4.5.
Initial hold (min) 5.   40.
Final hold (min)
I 1379.1378.1370.1370.1377.
ReferenceAskari and Sefidkon, 2006Javidnia, Miri, et al., 2006Palá-Paúl, Pérez-Alonso, et al., 2005Pala-Paul, Perez-Alonso, et al., 2005Baser, Özek, et al., 2000
Comment MSDC-RI MSDC-RI MSDC-RI MSDC-RI MSDC-RI
Column type Capillary
Active phase DB-5MS
Column length (m) 30.
Carrier gas He
Substrate
Column diameter (mm) 0.25
Phase thickness (μm) 0.25
Tstart (C) 60.
Tend (C) 240.
Heat rate (K/min) 3.
Initial hold (min)
Final hold (min)
I 1382.
ReferenceZoghbi, Andrade, et al., 1999
Comment MSDC-RI

References

Adams, 2000
Adams, R.P., Systematics of smooth leaf margin Juniperus of the western hemisphere based on leaf essential oils and RAPD DNA fingerprinting, Biochem. Syst. Ecol., 2000, 28, 2, 149-162, https://doi.org/10.1016/S0305-1978(99)00047-2 . [all data]

da Silva, Zoghbi, et al., 1999
da Silva, M.H.L.; Zoghbi, M.G.B.; Andrade, E.H.A.; Maia, J.G.S., The essential oils of Peperomia pellucida Kunth and P. circinnata link var. circinnata, Flavour Fragr. J., 1999, 14, 5, 312-314, https://doi.org/10.1002/(SICI)1099-1026(199909/10)14:5<312::AID-FFJ835>3.0.CO;2-B . [all data]